BDBM18366 (2R,3R,5S,6R)-2,6-bis(hydroxymethyl)piperidine-3,4,5-triol::alpha-homonojirimycin (alpha-HNJ)
SMILES OC[C@H]1N[C@H](CO)[C@H](O)C(O)[C@@H]1O
InChI Key InChIKey=CLVUFWXGNIFGNC-QTSLKERKSA-N
Data  1 IC50
  Tab Delimited (TSV)   2D SDfile   Computed 3D by Vconf -m prep SDfile
Find this compound or compounds like it in BindingDB:
Activity Spreadsheet -- Enzyme Inhibition Constant Data from BindingDB
Found 1 hit for monomerid = 18366
TargetProtein-lysine 6-oxidase(Homo sapiens (Human))
Hokuriku University
LigandPNGBDBM18366((2R,3R,5S,6R)-2,6-bis(hydroxymethyl)piperidine-3,4...)
Affinity DataIC50:  1.00E+3nMpH: 4.5 T: 2°C. Assay description: Enzyme activity was determined as the production of fluorescent 4-MU from the substrate. The fluorescence was measured (excitation 362 nm, emission 4...
In DepthDetails ArticlePubMed