BDBM183669 US9150519, 1-58
SMILES CC(C)CN(C1CCCC1)c1cc(ncn1)C(=O)Nc1ccc(cc1C)S(N)(=O)=O
InChI Key InChIKey=UARUCVJFMAAHCS-UHFFFAOYSA-N
Data  2 EC50
  Tab Delimited (TSV)   2D SDfile   Computed 3D by Vconf -m prep SDfile
Find this compound or compounds like it in BindingDB:
Activity Spreadsheet -- Enzyme Inhibition Constant Data from BindingDB
Found 2 hits for monomerid = 183669
TargetSphingosine 1-phosphate receptor 3(Homo sapiens (Human))
Merck Serono
US Patent
LigandPNGBDBM183669(US9150519, 1-58)
Affinity DataEC50: >2.00E+4nMpH: 7.4 T: 2°C. Assay description: Measurements of 35S-GTPgammaS Binding: Membranes (1 to 10 µg protein) prepared as described above, were incubated in 96-well Scintiplates (PerkinElm...
In DepthDetails US Patent
TargetSphingosine 1-phosphate receptor 1(Homo sapiens (Human))
Merck Serono
US Patent
LigandPNGBDBM183669(US9150519, 1-58)
Affinity DataEC50:  39nMpH: 7.4 T: 2°C. Assay description: Measurements of 35S-GTPgammaS Binding: Membranes (1 to 10 µg protein) prepared as described above, were incubated in 96-well Scintiplates (PerkinElm...
In DepthDetails US Patent