BDBM183796 US9150526, 46
SMILES COc1cc(OC(F)(F)F)ccc1-c1cccc(c1)C(CC(O)=O)c1nccs1
InChI Key InChIKey=GAPHMWSPEODBJK-UHFFFAOYSA-N
Data  1 IC50
  Tab Delimited (TSV)   2D SDfile   Computed 3D by Vconf -m prep SDfile
Find this compound or compounds like it in BindingDB:
Activity Spreadsheet -- Enzyme Inhibition Constant Data from BindingDB
Found 1 hit for monomerid = 183796
TargetLysosomal protective protein [29-480](Homo sapiens (Human))
Sanofi
US Patent
LigandPNGBDBM183796(US9150526, 46)
Affinity DataIC50:  1.53E+3nMpH: 6.0 T: 2°C. Assay description: Recombinant human cathepsin A (residues 29-480, with a C-terminal 10-His tag; R&D Systems, #1049-SE) was proteolytically activated with recombinant h...
In DepthDetails US Patent