BDBM183823 US9150526, 76
SMILES COc1ccc(OC)c(c1)-c1cc(Cl)cc(c1)C(CC(O)=O)c1ncc(C)s1
InChI Key InChIKey=NEVKJTCNYPFBNM-UHFFFAOYSA-N
Data  1 IC50
  Tab Delimited (TSV)   2D SDfile   Computed 3D by Vconf -m prep SDfile
Find this compound or compounds like it in BindingDB:
Activity Spreadsheet -- Enzyme Inhibition Constant Data from BindingDB
Found 1 hit for monomerid = 183823
TargetLysosomal protective protein [29-480](Homo sapiens (Human))
Sanofi
US Patent
LigandPNGBDBM183823(US9150526, 76)
Affinity DataIC50:  28nMpH: 6.0 T: 2°C. Assay description: Recombinant human cathepsin A (residues 29-480, with a C-terminal 10-His tag; R&D Systems, #1049-SE) was proteolytically activated with recombinant h...
In DepthDetails US Patent