BDBM183911 US9150526, 168
SMILES COc1ccc(OC(F)(F)F)cc1-c1cc(F)cc(c1)C(CC(O)=O)c1nnc(C)o1
InChI Key InChIKey=GSUHPEHSJHRTEX-UHFFFAOYSA-N
Data  1 IC50
  Tab Delimited (TSV)   2D SDfile   Computed 3D by Vconf -m prep SDfile
Find this compound or compounds like it in BindingDB:
Activity Spreadsheet -- Enzyme Inhibition Constant Data from BindingDB
Found 1 hit for monomerid = 183911
TargetLysosomal protective protein [29-480](Homo sapiens (Human))
Sanofi
US Patent
LigandPNGBDBM183911(US9150526, 168)
Affinity DataIC50:  165nMpH: 6.0 T: 2°C. Assay description: Recombinant human cathepsin A (residues 29-480, with a C-terminal 10-His tag; R&D Systems, #1049-SE) was proteolytically activated with recombinant h...
In DepthDetails US Patent