BDBM184558 US9150579, A2
SMILES CC(C)Oc1ccc(cc1F)-c1nn([C@H](C)c2oc3ccccc3c(=O)c2-c2cccc(F)c2)c2ncnc(N)c12
InChI Key InChIKey=FHEVWNCATJTNQI-QGZVFWFLSA-N
Data  1 IC50
  Tab Delimited (TSV)   2D SDfile   Computed 3D by Vconf -m prep SDfile
Find this compound or compounds like it in BindingDB:
Activity Spreadsheet -- Enzyme Inhibition Constant Data from BindingDB
Found 1 hit for monomerid = 184558
TargetPhosphatidylinositol 4,5-bisphosphate 3-kinase catalytic subunit delta isoform(Homo sapiens (Human))
Rhizen Pharmaceuticals
US Patent
LigandPNGBDBM184558(US9150579, A2)
Affinity DataIC50: >1.00E+4nMT: 2°C. Assay description: The homogenous time resolved fluorescence (HTRF) assay allows detection of 3,4,5-triphosphate (PIP3) formed as a result of phosphorylation of phosp...
In DepthDetails US Patent