BDBM185033 US9156811, DDD99821
SMILES CC(C)Cc1nn(C)c(C)c1N[S+]([O-])(=O)c1ccc(cc1)-c1cccc(CN2CCC(C2)N(C)C)c1
InChI Key InChIKey=WXABSNJPQOWVKF-UHFFFAOYSA-N
Data  2 IC50
  Tab Delimited (TSV)   2D SDfile   Computed 3D by Vconf -m prep SDfile
Find this compound or compounds like it in BindingDB:
Activity Spreadsheet -- Enzyme Inhibition Constant Data from BindingDB
Found 2 hits for monomerid = 185033
TargetGlycylpeptide N-tetradecanoyltransferase 1(Homo sapiens (Human))
Univeristy Of Dundee
US Patent
LigandPNGBDBM185033(US9156811, DDD99821)
Affinity DataIC50:  3.80E+3nMpH: 7.4 T: 2°C. Assay description: Measurement of the ability of compounds to inhibit the NMT-1 and/or NMT-2 enzyme isoforms of human, trypanosome (T. brucei), leishmanial (L. major) a...
In DepthDetails US Patent
TargetGlycylpeptide N-tetradecanoyltransferase(Trypanosoma brucei)
Univeristy Of Dundee
US Patent
LigandPNGBDBM185033(US9156811, DDD99821)
Affinity DataIC50:  160nMpH: 7.4 T: 2°C. Assay description: Measurement of the ability of compounds to inhibit the NMT-1 and/or NMT-2 enzyme isoforms of human, trypanosome (T. brucei), leishmanial (L. major) a...
In DepthDetails US Patent