BDBM185149 1-[2-[5-[(3-methyloxetan-3-yl)methoxy]benzimidazol-1-yl]quinolin-8-yl]piperidin-4-amine::Crenolanib::US11542261, Compound crenolanib
SMILES CC1(COc2ccc3n(cnc3c2)-c2ccc3cccc(N4CCC(N)CC4)c3n2)COC1
InChI Key InChIKey=DYNHJHQFHQTFTP-UHFFFAOYSA-N
Data  11 IC50  18 Kd
PDB links: 4 PDB IDs match this monomer.
  Tab Delimited (TSV)   2D SDfile   Computed 3D by Vconf -m prep SDfile
Find this compound or compounds like it in BindingDB:
Activity Spreadsheet -- Enzyme Inhibition Constant Data from BindingDB
Found 29 hits for monomerid = 185149
TargetFerrochelatase, mitochondrial [R115L](Homo sapiens (Human))
Technical University Of Munich
LigandPNGBDBM185149(1-[2-[5-[(3-methyloxetan-3-yl)methoxy]benzimidazol...)
Affinity DataKd:  3.80E+3nM. Assay description: Briefly, 5 mg of a protein mixture of the four cell lines or a single cell line were incubated with compound dilution series in DMSO (3 nM, 10 nM, 30...
In DepthDetails ArticlePubMed
TargetReceptor-type tyrosine-protein kinase FLT3(Homo sapiens (Human))
Ain Shams University
Curated by ChEMBL
LigandPNGBDBM185149(1-[2-[5-[(3-methyloxetan-3-yl)methoxy]benzimidazol...)
Affinity DataIC50:  1.30nM. Assay description: Inhibition of FLT3-ITD autophosphorylation in human MV4-11 cells measured after 2 hrs by Western blot analysis
In DepthDetails PubMed
TargetReceptor-type tyrosine-protein kinase FLT3(Homo sapiens (Human))
Ain Shams University
Curated by ChEMBL
LigandPNGBDBM185149(1-[2-[5-[(3-methyloxetan-3-yl)methoxy]benzimidazol...)
Affinity DataIC50:  3nM. Assay description: Competitive inhibition of FLT3 ITD mutant (unknown origin) in presence of ATP
In DepthDetails ArticlePubMed
TargetReceptor-type tyrosine-protein kinase FLT3(Homo sapiens (Human))
Ain Shams University
Curated by ChEMBL
LigandPNGBDBM185149(1-[2-[5-[(3-methyloxetan-3-yl)methoxy]benzimidazol...)
Affinity DataIC50:  4nM. Assay description: Competitive inhibition of FLT3 D835Y mutant (unknown origin) in presence of ATP
In DepthDetails ArticlePubMed
TargetReceptor-type tyrosine-protein kinase FLT3(Homo sapiens (Human))
Ain Shams University
Curated by ChEMBL
LigandPNGBDBM185149(1-[2-[5-[(3-methyloxetan-3-yl)methoxy]benzimidazol...)
Affinity DataIC50:  35nM. Assay description: Inhibition of FLT3 ITD/D835H double mutant (unknown origin)
In DepthDetails ArticlePubMed
TargetReceptor-type tyrosine-protein kinase FLT3(Homo sapiens (Human))
Ain Shams University
Curated by ChEMBL
LigandPNGBDBM185149(1-[2-[5-[(3-methyloxetan-3-yl)methoxy]benzimidazol...)
Affinity DataIC50:  35nM. Assay description: Inhibition of FLT3 ITD/D835Y double mutant (unknown origin)
In DepthDetails ArticlePubMed
TargetReceptor-type tyrosine-protein kinase FLT3(Homo sapiens (Human))
Ain Shams University
Curated by ChEMBL
LigandPNGBDBM185149(1-[2-[5-[(3-methyloxetan-3-yl)methoxy]benzimidazol...)
Affinity DataIC50:  0.300nM. Assay description: Inhibition of FLT3 D835H mutant (unknown origin)
In DepthDetails ArticlePubMed
TargetReceptor-type tyrosine-protein kinase FLT3(Homo sapiens (Human))
Ain Shams University
Curated by ChEMBL
LigandPNGBDBM185149(1-[2-[5-[(3-methyloxetan-3-yl)methoxy]benzimidazol...)
Affinity DataIC50:  0.0600nM. Assay description: Inhibition of FLT3 D835Y mutant (unknown origin)
In DepthDetails ArticlePubMed
TargetReceptor-type tyrosine-protein kinase FLT3(Homo sapiens (Human))
Ain Shams University
Curated by ChEMBL
LigandPNGBDBM185149(1-[2-[5-[(3-methyloxetan-3-yl)methoxy]benzimidazol...)
Affinity DataKd:  0.150nM. Assay description: Binding affinity to non-auto-inhibited form of wild type human N-terminal GST-tagged FLT3 expressed in baculovirus expression
In DepthDetails ArticlePubMed
TargetReceptor-type tyrosine-protein kinase FLT3(Homo sapiens (Human))
Ain Shams University
Curated by ChEMBL
LigandPNGBDBM185149(1-[2-[5-[(3-methyloxetan-3-yl)methoxy]benzimidazol...)
Affinity DataKd:  0.160nM. Assay description: Binding affinity to human FLT3 D835H mutant expressed in baculovirus expression system
In DepthDetails ArticlePubMed
TargetReceptor-type tyrosine-protein kinase FLT3(Homo sapiens (Human))
Ain Shams University
Curated by ChEMBL
LigandPNGBDBM185149(1-[2-[5-[(3-methyloxetan-3-yl)methoxy]benzimidazol...)
Affinity DataKd:  0.260nM. Assay description: Binding affinity to human FLT3 ITD mutant expressed in baculovirus expression system
In DepthDetails ArticlePubMed
TargetReceptor-type tyrosine-protein kinase FLT3(Homo sapiens (Human))
Ain Shams University
Curated by ChEMBL
LigandPNGBDBM185149(1-[2-[5-[(3-methyloxetan-3-yl)methoxy]benzimidazol...)
Affinity DataKd:  22nM. Assay description: Binding affinity to human FLT3 ITD/F691L double mutant expressed in baculovirus expression system
In DepthDetails ArticlePubMed
TargetReceptor-type tyrosine-protein kinase FLT3(Homo sapiens (Human))
Ain Shams University
Curated by ChEMBL
LigandPNGBDBM185149(1-[2-[5-[(3-methyloxetan-3-yl)methoxy]benzimidazol...)
Affinity DataIC50:  1.30nM. Assay description: Inhibition of FLT3 (unknown origin)
In DepthDetails ArticlePubMed
TargetReceptor-type tyrosine-protein kinase FLT3(Homo sapiens (Human))
Ain Shams University
Curated by ChEMBL
LigandPNGBDBM185149(1-[2-[5-[(3-methyloxetan-3-yl)methoxy]benzimidazol...)
Affinity DataKd:  0.200nM. Assay description: Table 8-10: Compounds were tested in 10-dose IC50 mode with 3-fold serial dilution starting at 10 uM, and are relative to DMSO, the negative control....
In DepthDetails US Patent
TargetReceptor-type tyrosine-protein kinase FLT3 [D835H](Homo sapiens (Human))
Children'S Hospital Medical Center
US Patent
LigandPNGBDBM185149(1-[2-[5-[(3-methyloxetan-3-yl)methoxy]benzimidazol...)
Affinity DataKd:  0.200nM. Assay description: Table 8-10: Compounds were tested in 10-dose IC50 mode with 3-fold serial dilution starting at 10 uM, and are relative to DMSO, the negative control....
In DepthDetails US Patent
TargetReceptor-type tyrosine-protein kinase FLT3 [D835V](Homo sapiens (Human))
Children'S Hospital Medical Center
US Patent
LigandPNGBDBM185149(1-[2-[5-[(3-methyloxetan-3-yl)methoxy]benzimidazol...)
Affinity DataKd:  0.0160nM. Assay description: Table 8-10: Compounds were tested in 10-dose IC50 mode with 3-fold serial dilution starting at 10 uM, and are relative to DMSO, the negative control....
In DepthDetails US Patent
TargetReceptor-type tyrosine-protein kinase FLT3 [D835Y](Homo sapiens (Human))
Children'S Hospital Medical Center
US Patent
LigandPNGBDBM185149(1-[2-[5-[(3-methyloxetan-3-yl)methoxy]benzimidazol...)
Affinity DataKd:  0.190nM. Assay description: Table 8-10: Compounds were tested in 10-dose IC50 mode with 3-fold serial dilution starting at 10 uM, and are relative to DMSO, the negative control....
In DepthDetails US Patent
TargetDimer of Receptor-type tyrosine-protein kinase FLT3(Homo sapiens (Human))
Children'S Hospital Medical Center
US Patent
LigandPNGBDBM185149(1-[2-[5-[(3-methyloxetan-3-yl)methoxy]benzimidazol...)
Affinity DataKd:  0.260nM. Assay description: Table 7 For most assays, kinase-tagged T7 phage strains were prepared in an E. coli host derived from the BL21 strain. E. coli were grown to log-phas...
In DepthDetails US Patent
TargetDimer of Receptor-type tyrosine-protein kinase FLT3 [D835V](Homo sapiens (Human))
Children'S Hospital Medical Center
US Patent
LigandPNGBDBM185149(1-[2-[5-[(3-methyloxetan-3-yl)methoxy]benzimidazol...)
Affinity DataKd:  0.0230nM. Assay description: Table 7 For most assays, kinase-tagged T7 phage strains were prepared in an E. coli host derived from the BL21 strain. E. coli were grown to log-phas...
In DepthDetails US Patent
TargetDimer of Receptor-type tyrosine-protein kinase FLT3 [F691L](Homo sapiens (Human))
Children'S Hospital Medical Center
US Patent
LigandPNGBDBM185149(1-[2-[5-[(3-methyloxetan-3-yl)methoxy]benzimidazol...)
Affinity DataKd:  0.110nM. Assay description: Table 7 For most assays, kinase-tagged T7 phage strains were prepared in an E. coli host derived from the BL21 strain. E. coli were grown to log-phas...
In DepthDetails US Patent
TargetReceptor-type tyrosine-protein kinase FLT3(Homo sapiens (Human))
Ain Shams University
Curated by ChEMBL
LigandPNGBDBM185149(1-[2-[5-[(3-methyloxetan-3-yl)methoxy]benzimidazol...)
Affinity DataKd:  0.820nM. Assay description: Table 7 For most assays, kinase-tagged T7 phage strains were prepared in an E. coli host derived from the BL21 strain. E. coli were grown to log-phas...
In DepthDetails US Patent
TargetReceptor-type tyrosine-protein kinase FLT3 [N841I](Homo sapiens (Human))
Children'S Hospital Medical Center
US Patent
LigandPNGBDBM185149(1-[2-[5-[(3-methyloxetan-3-yl)methoxy]benzimidazol...)
Affinity DataKd:  0.390nM. Assay description: Table 7 For most assays, kinase-tagged T7 phage strains were prepared in an E. coli host derived from the BL21 strain. E. coli were grown to log-phas...
In DepthDetails US Patent
TargetReceptor-type tyrosine-protein kinase FLT3 [R834Q](Homo sapiens (Human))
Children'S Hospital Medical Center
US Patent
LigandPNGBDBM185149(1-[2-[5-[(3-methyloxetan-3-yl)methoxy]benzimidazol...)
Affinity DataKd:  1.30nM. Assay description: Table 7 For most assays, kinase-tagged T7 phage strains were prepared in an E. coli host derived from the BL21 strain. E. coli were grown to log-phas...
In DepthDetails US Patent
TargetReceptor-type tyrosine-protein kinase FLT3 [564-710,762-958](Homo sapiens (Human))
Children'S Hospital Medical Center
US Patent
LigandPNGBDBM185149(1-[2-[5-[(3-methyloxetan-3-yl)methoxy]benzimidazol...)
Affinity DataKd:  17nM. Assay description: Table 7 For most assays, kinase-tagged T7 phage strains were prepared in an E. coli host derived from the BL21 strain. E. coli were grown to log-phas...
In DepthDetails US Patent
TargetInterleukin-1 receptor-associated kinase 1(Homo sapiens (Human))
Children'S Hospital Medical Center
US Patent
LigandPNGBDBM185149(1-[2-[5-[(3-methyloxetan-3-yl)methoxy]benzimidazol...)
Affinity DataKd:  260nM. Assay description: Table 7 For most assays, kinase-tagged T7 phage strains were prepared in an E. coli host derived from the BL21 strain. E. coli were grown to log-phas...
In DepthDetails US Patent
TargetInterleukin-1 receptor-associated kinase 4(Homo sapiens (Human))
Children'S Hospital Medical Center
US Patent
LigandPNGBDBM185149(1-[2-[5-[(3-methyloxetan-3-yl)methoxy]benzimidazol...)
Affinity DataKd:  62nM. Assay description: Table 8-10: Compounds were tested in 10-dose IC50 mode with 3-fold serial dilution starting at 10 uM, and are relative to DMSO, the negative control....
In DepthDetails US Patent
TargetReceptor-type tyrosine-protein kinase FLT3(Homo sapiens (Human))
Ain Shams University
Curated by ChEMBL
LigandPNGBDBM185149(1-[2-[5-[(3-methyloxetan-3-yl)methoxy]benzimidazol...)
Affinity DataIC50:  6.90nM. Assay description: Inhibition of FLT3-D835Y autophosphorylation in human MV4-11 cells measured after 2 hrs by Western blot analysis
In DepthDetails PubMed
TargetReceptor-type tyrosine-protein kinase FLT3(Homo sapiens (Human))
Ain Shams University
Curated by ChEMBL
LigandPNGBDBM185149(1-[2-[5-[(3-methyloxetan-3-yl)methoxy]benzimidazol...)
Affinity DataIC50:  2nM. Assay description: Inhibition of FLT3 autophosphorylation in human RS4-11 cells measured after 2 hrs by Western blot analysis
In DepthDetails PubMed
TargetSerine/threonine-protein kinase/endoribonuclease IRE1 [547-977](Homo sapiens (Human))
University Of Washington
LigandPNGBDBM185149(1-[2-[5-[(3-methyloxetan-3-yl)methoxy]benzimidazol...)
Affinity DataIC50:  790nMpH: 7.5Assay Description:Inhibitors (initial concentration 10 or 60 μM, three-fold serial dilutions) were incubated with IRE1α* in cleavage buffer (20 mM HEPES at p...
In DepthDetails ArticlePubMed