BDBM185297 US10011588, Example 114::US10689373, Example 114::US9156829, 114
SMILES CCc1cnc(N[C@H]2CCC[C@@H]2NC(=O)c2ccccc2-n2nccn2)cn1
InChI Key InChIKey=CNZGIHJORNGBDA-IRXDYDNUSA-N
Data  6 IC50
  Tab Delimited (TSV)   2D SDfile   Computed 3D by Vconf -m prep SDfile
Find this compound or compounds like it in BindingDB:
Activity Spreadsheet -- Enzyme Inhibition Constant Data from BindingDB
Found 6 hits for monomerid = 185297
TargetOrexin/Hypocretin receptor type 1(Homo sapiens (Human))
Takeda Pharmaceutical
US Patent
LigandPNGBDBM185297(US10011588, Example 114 | US10689373, Example 114 ...)
Affinity DataIC50:  997nMT: 2°C. Assay description: Orexin antagonist activity was determined by measuring changes in intracellular calcium levels using a Ca.sup.2+ sensitive fluorescent dye. The chang...
In DepthDetails US Patent
TargetOrexin receptor type 2(Homo sapiens (Human))
Takeda Pharmaceutical
US Patent
LigandPNGBDBM185297(US10011588, Example 114 | US10689373, Example 114 ...)
Affinity DataIC50: >1.00E+4nMT: 2°C. Assay description: Orexin antagonist activity was determined by measuring changes in intracellular calcium levels using a Ca.sup.2+ sensitive fluorescent dye. The chang...
In DepthDetails US Patent
TargetOrexin receptor type 2(Homo sapiens (Human))
Takeda Pharmaceutical
US Patent
LigandPNGBDBM185297(US10011588, Example 114 | US10689373, Example 114 ...)
Affinity DataIC50: >1.00E+4nM. Assay description: Orexin antagonist activity was determined by measuring changes in intracellular calcium levels using a Ca2+ sensitive fluorescent dye. The changes in...
In DepthDetails US Patent
TargetOrexin receptor type 2(Homo sapiens (Human))
Takeda Pharmaceutical
US Patent
LigandPNGBDBM185297(US10011588, Example 114 | US10689373, Example 114 ...)
Affinity DataIC50: >1.00E+4nM. Assay description: Orexin antagonist activity was determined by measuring changes in intracellular calcium levels using a Ca2+ sensitive fluorescent dye. The changes in...
In DepthDetails US Patent
TargetOrexin/Hypocretin receptor type 1(Homo sapiens (Human))
Takeda Pharmaceutical
US Patent
LigandPNGBDBM185297(US10011588, Example 114 | US10689373, Example 114 ...)
Affinity DataIC50:  997nM. Assay description: Orexin antagonist activity was determined by measuring changes in intracellular calcium levels using a Ca2+ sensitive fluorescent dye. The changes in...
In DepthDetails US Patent
TargetOrexin/Hypocretin receptor type 1(Homo sapiens (Human))
Takeda Pharmaceutical
US Patent
LigandPNGBDBM185297(US10011588, Example 114 | US10689373, Example 114 ...)
Affinity DataIC50:  997nM. Assay description: Orexin antagonist activity was determined by measuring changes in intracellular calcium levels using a Ca2+ sensitive fluorescent dye. The changes in...
In DepthDetails US Patent