BDBM185442 US9156845, 91
SMILES Fc1cccc(c1)-c1c[nH]c2ncnc(N3CCOCC3)c12
InChI Key InChIKey=AXVWXYOCYXZGCZ-UHFFFAOYSA-N
Data  7 IC50
  Tab Delimited (TSV)   2D SDfile   Computed 3D by Vconf -m prep SDfile
Find this compound or compounds like it in BindingDB:
Activity Spreadsheet -- Enzyme Inhibition Constant Data from BindingDB
Found 7 hits for monomerid = 185442
TargetLeucine-rich repeat serine/threonine-protein kinase 2(Homo sapiens (Human))
Pfizer
US Patent
LigandPNGBDBM185442(US9156845, 91)
Affinity DataIC50:  9nMpH: 7.5Assay Description:LRRK2 kinase activity was measured using Lantha Screen technology from Invitrogen. GST-tagged truncated LRRK2 from Invitrogen (Cat # PV4874) was incu...
In DepthDetails US Patent
TargetLeucine-rich repeat serine/threonine-protein kinase 2 [G2019S](Homo sapiens (Human))
Pfizer
US Patent
LigandPNGBDBM185442(US9156845, 91)
Affinity DataIC50:  21nMpH: 7.5Assay Description:LRRK2 kinase activity was measured using Lantha Screen technology from Invitrogen. GST-tagged truncated LRRK2 from Invitrogen (Cat # PV4874) was incu...
In DepthDetails US Patent
TargetSerine/threonine-protein kinase 4(Homo sapiens (Human))
Sanford Burnham Prebys Medical Discovery Institute
Curated by ChEMBL
LigandPNGBDBM185442(US9156845, 91)
Affinity DataIC50:  59nM. Assay description: Inhibition of recombinant N-terminal His6-tagged human STK4 (43 to 431 residues) expressed in Escherichia coli using myelin basic protein as substrat...
In DepthDetails ArticlePubMed
TargetLeucine-rich repeat serine/threonine-protein kinase 2(Homo sapiens (Human))
Pfizer
US Patent
LigandPNGBDBM185442(US9156845, 91)
Affinity DataIC50:  246nM. Assay description: Displacement of K5 tracer from full length C-terminal NanoLuc fused human LRRK2 expressed in HEK293T cells incubated for 2 hrs by NanoBRET assay
In DepthDetails ArticlePubMed
TargetSerine/threonine-protein kinase 3(Homo sapiens (Human))
Sanford Burnham Prebys Medical Discovery Institute
Curated by ChEMBL
LigandPNGBDBM185442(US9156845, 91)
Affinity DataIC50:  373nM. Assay description: Displacement of K5 tracer from full length C-terminal NanoLuc fused human STK3 expressed in HEK293T cells incubated for 2 hrs by NanoBRET assay
In DepthDetails ArticlePubMed
TargetSerine/threonine-protein kinase 4(Homo sapiens (Human))
Sanford Burnham Prebys Medical Discovery Institute
Curated by ChEMBL
LigandPNGBDBM185442(US9156845, 91)
Affinity DataIC50:  527nM. Assay description: Displacement of K5 tracer from full length C-terminal NanoLuc fused human STK4 expressed in HEK293T cells incubated for 2 hrs by NanoBRET assay
In DepthDetails ArticlePubMed
TargetSerine/threonine-protein kinase 3(Homo sapiens (Human))
Sanford Burnham Prebys Medical Discovery Institute
Curated by ChEMBL
LigandPNGBDBM185442(US9156845, 91)
Affinity DataIC50:  191nM. Assay description: Inhibition of recombinant N-terminal His6-tagged human STK3 (18 to 311 residues) expressed in Escherichia coli using myelin basic protein as substrat...
In DepthDetails ArticlePubMed