BDBM186226 US9163015, 12
SMILES Fc1cccc(Nc2n[nH]c3cccnc23)c1
InChI Key InChIKey=KPFDJVOMBUAQPT-UHFFFAOYSA-N
Data  1 EC50
  Tab Delimited (TSV)   2D SDfile   Computed 3D by Vconf -m prep SDfile
Find this compound or compounds like it in BindingDB:
Activity Spreadsheet -- Enzyme Inhibition Constant Data from BindingDB
Found 1 hit for monomerid = 186226
TargetMetabotropic glutamate receptor 4(Homo sapiens (Human))
Vanderbilt University
US Patent
LigandPNGBDBM186226(US9163015, 12)
Affinity DataEC50:  584nM. Assay description: The disclosed compounds and compositions can be evaluated for their ability to act as a potentiator of metabotropic glutamate receptor activity, in p...
In DepthDetails US Patent