BDBM186266 US9163015, 52
SMILES Clc1cc(Nc2n[nH]c3cccnc23)ccc1Oc1ccccn1
InChI Key InChIKey=YKLFCQRBEGYLSF-UHFFFAOYSA-N
Data  1 EC50
  Tab Delimited (TSV)   2D SDfile   Computed 3D by Vconf -m prep SDfile
Find this compound or compounds like it in BindingDB:
Activity Spreadsheet -- Enzyme Inhibition Constant Data from BindingDB
Found 1 hit for monomerid = 186266
TargetMetabotropic glutamate receptor 4(Homo sapiens (Human))
Vanderbilt University
US Patent
LigandPNGBDBM186266(US9163015, 52)
Affinity DataEC50:  112nM. Assay description: The disclosed compounds and compositions can be evaluated for their ability to act as a potentiator of metabotropic glutamate receptor activity, in p...
In DepthDetails US Patent