BDBM186597 US9168248, 42
SMILES Cc1cccc2OC3(CCN(CC3)c3ncc(s3)-c3nnn(CC(O)=O)n3)CCc12
InChI Key InChIKey=ZGNDLGFUYNRRBQ-UHFFFAOYSA-N
Data  1 IC50
  Tab Delimited (TSV)   2D SDfile   Computed 3D by Vconf -m prep SDfile
Find this compound or compounds like it in BindingDB:
Activity Spreadsheet -- Enzyme Inhibition Constant Data from BindingDB
Found 1 hit for monomerid = 186597
TargetStearoyl-CoA desaturase(Homo sapiens (Human))
Merck Canada
US Patent
LigandPNGBDBM186597(US9168248, 42)
Affinity DataIC50:  1nMpH: 7.5Assay Description:The potency of compounds of formula I against the stearoyl-CoA desaturase was determined by measuring the conversion of radiolabeled stearoyl-CoA to ...
In DepthDetails US Patent