BDBM186602 US9168248, 75
SMILES OC(=O)Cn1nnc(n1)-c1nnc(s1)N1CCC2(CC1)CCc1c(O2)cccc1C(F)(F)F
InChI Key InChIKey=ZLJXCGINXMZSHV-UHFFFAOYSA-N
Data  1 IC50
  Tab Delimited (TSV)   2D SDfile   Computed 3D by Vconf -m prep SDfile
Find this compound or compounds like it in BindingDB:
Activity Spreadsheet -- Enzyme Inhibition Constant Data from BindingDB
Found 1 hit for monomerid = 186602
TargetStearoyl-CoA desaturase(Homo sapiens (Human))
Merck Canada
US Patent
LigandPNGBDBM186602(US9168248, 75)
Affinity DataIC50:  1nMpH: 7.5Assay Description:The potency of compounds of formula I against the stearoyl-CoA desaturase was determined by measuring the conversion of radiolabeled stearoyl-CoA to ...
In DepthDetails US Patent