BDBM186640 US9169205, 1.37
SMILES COCCCOc1ccc(N2CCC(C2)Oc2ccc(cc2)[C@H](C)NC(C)=O)c(F)c1
InChI Key InChIKey=IMUWLFOOLIOQRH-LBOXEOMUSA-N
Data  1 IC50
  Tab Delimited (TSV)   2D SDfile   Computed 3D by Vconf -m prep SDfile
Find this compound or compounds like it in BindingDB:
Activity Spreadsheet -- Enzyme Inhibition Constant Data from BindingDB
Found 1 hit for monomerid = 186640
TargetAcetyl-CoA carboxylase 2(Homo sapiens (Human))
Boehringer Ingelheim International
US Patent
LigandPNGBDBM186640(US9169205, 1.37)
Affinity DataIC50:  484nMpH: 7.5Assay Description:Assay reactions are then carried out in 384-well plates, with hACC2 in an appropriate dilution and at final assay concentrations (f.c.) of 100 mM Tri...
In DepthDetails US Patent