BDBM186895 US9670157, 61 1-(4-Methoxy-benzyl)-2,5-dimethyl-1H-pyrrole-3-carboxylic acid4-aminomethyl-benzylamide
SMILES COc1ccc(Cn2c(C)cc(C(=O)NCc3ccc(CN)cc3)c2C)cc1
InChI Key InChIKey=AEINFUDDNRIDPG-UHFFFAOYSA-N
Data  2 IC50
  Tab Delimited (TSV)   2D SDfile   Computed 3D by Vconf -m prep SDfile
Find this compound or compounds like it in BindingDB:
Activity Spreadsheet -- Enzyme Inhibition Constant Data from BindingDB
Found 2 hits for monomerid = 186895
TargetKallikrein-1(Homo sapiens (Human))
Kalvista Pharmaceuticals
US Patent
LigandPNGBDBM186895(US9670157, 61 1-(4-Methoxy-benzyl)-2,5-dimethyl-1H...)
Affinity DataIC50: >1.00E+4nM. Assay description: KLK1 inhibitory activity in vitro was determined using standard published methods (see e.g. Johansen et al., Int. J. Tiss. Reac. 1986, 8, 185; Shori ...
Ligand InfoPC cidPC sid
In DepthDetails US Patent
TargetPlasma kallikrein(Homo sapiens (Human))
Kalvista Pharmaceuticals
US Patent
LigandPNGBDBM186895(US9670157, 61 1-(4-Methoxy-benzyl)-2,5-dimethyl-1H...)
Affinity DataIC50:  2.99E+3nM. Assay description: Plasma kallikrein inhibitory activity in vitro was determined using standard published methods (see e.g. Johansen et al., Int. J. Tiss. Reac. 1986, 8...
Ligand InfoPC cidPC sid
In DepthDetails US Patent