BDBM187200 US9670181, 76 6,7-dimethoxy-4-((6-methoxy-2-((2-methoxyethyl)amino)quinolin-3-yl)methyl)-1-propylisoquinolin-3-ol
SMILES CCCc1nc(O)c(Cc2cc3cc(OC)ccc3nc2NCCOC)c2cc(OC)c(OC)cc12
InChI Key InChIKey=UBYYRTPYFNHDOR-UHFFFAOYSA-N
Data  1 IC50
  Tab Delimited (TSV)   2D SDfile   Computed 3D by Vconf -m prep SDfile
Find this compound or compounds like it in BindingDB:
Activity Spreadsheet -- Enzyme Inhibition Constant Data from BindingDB
Found 1 hit for monomerid = 187200
TargetcAMP and cAMP-inhibited cGMP 3',5'-cyclic phosphodiesterase 10A(Homo sapiens (Human))
Allergan
US Patent
LigandPNGBDBM187200(US9670181, 76 6,7-dimethoxy-4-((6-methoxy-2-((2-me...)
Affinity DataIC50:  2.30nMpH: 7.4 T: 2°C. Assay description: The PDE assay is based on the homogenous time-resolved fluorescence resonance energy transfer (TR-FRET) technology (LANCE® from Perkin Elmer). This c...
Ligand InfoPC cidPC sid
In DepthDetails US Patent