BDBM187484 US9169252, 84
SMILES CC(C)Nc1cc(ncc1C(=O)N[C@H]1CC[C@@H](CC1)NC(C)=O)-n1ccc2cncnc12
InChI Key InChIKey=IABLHLGYPHASNB-IYARVYRRSA-N
Data  1 IC50
  Tab Delimited (TSV)   2D SDfile   Computed 3D by Vconf -m prep SDfile
Find this compound or compounds like it in BindingDB:
Activity Spreadsheet -- Enzyme Inhibition Constant Data from BindingDB
Found 1 hit for monomerid = 187484
TargetInterleukin-1 receptor-associated kinase 4(Homo sapiens (Human))
Bristol-Myers Squibb
US Patent
LigandPNGBDBM187484(US9169252, 84)
Affinity DataIC50:  9.30nMpH: 7.2Assay Description:The assays were performed in U-bottom 384-well plates. The final assay volume was 30 L prepared from 15 L additions of enzyme and substrates (fluores...
In DepthDetails US Patent