BDBM187578 US9169252, 142::US9169252, 143
SMILES CC(C)(O)[C@H](F)CNC(=O)c1cnc(cc1NC1CCCOC1)-n1ncc2cc(cnc12)C#N
InChI Key InChIKey=DQYRLGQECPTQCM-LRTDYKAYSA-N
Data  2 IC50
  Tab Delimited (TSV)   2D SDfile   Computed 3D by Vconf -m prep SDfile
Find this compound or compounds like it in BindingDB:
Activity Spreadsheet -- Enzyme Inhibition Constant Data from BindingDB
Found 2 hits for monomerid = 187578
TargetInterleukin-1 receptor-associated kinase 4(Homo sapiens (Human))
Bristol-Myers Squibb
US Patent
LigandPNGBDBM187578(US9169252, 142 | US9169252, 143)
Affinity DataIC50:  6.5nMpH: 7.2Assay Description:The assays were performed in U-bottom 384-well plates. The final assay volume was 30 L prepared from 15 L additions of enzyme and substrates (fluores...
In DepthDetails US Patent
TargetInterleukin-1 receptor-associated kinase 4(Homo sapiens (Human))
Bristol-Myers Squibb
US Patent
LigandPNGBDBM187578(US9169252, 142 | US9169252, 143)
Affinity DataIC50:  11.4nMpH: 7.2Assay Description:The assays were performed in U-bottom 384-well plates. The final assay volume was 30 L prepared from 15 L additions of enzyme and substrates (fluores...
In DepthDetails US Patent