BDBM187807 US9169252, 350
SMILES CC(C)(C)Cn1cc(Nc2cc(ncc2C(=O)NC[C@@H](F)C(C)(C)O)-n2ncc3cc(cnc23)C#N)cn1
InChI Key InChIKey=AJBPLFOBBUKJTD-OAQYLSRUSA-N
Data  1 IC50
  Tab Delimited (TSV)   2D SDfile   Computed 3D by Vconf -m prep SDfile
Find this compound or compounds like it in BindingDB:
Activity Spreadsheet -- Enzyme Inhibition Constant Data from BindingDB
Found 1 hit for monomerid = 187807
TargetInterleukin-1 receptor-associated kinase 4(Homo sapiens (Human))
Bristol-Myers Squibb
US Patent
LigandPNGBDBM187807(US9169252, 350)
Affinity DataIC50:  2.20nMpH: 7.2Assay Description:The assays were performed in U-bottom 384-well plates. The final assay volume was 30 L prepared from 15 L additions of enzyme and substrates (fluores...
In DepthDetails US Patent