BDBM187811 US9169252, 354
SMILES CC(C)(O)[C@H](F)CNC(=O)c1cnc(cc1Nc1cnn(CC(F)(F)F)c1)-n1ncc2cc(Cl)cnc12
InChI Key InChIKey=OBGHRBOKXNOHPI-QGZVFWFLSA-N
Data  1 IC50
  Tab Delimited (TSV)   2D SDfile   Computed 3D by Vconf -m prep SDfile
Find this compound or compounds like it in BindingDB:
Activity Spreadsheet -- Enzyme Inhibition Constant Data from BindingDB
Found 1 hit for monomerid = 187811
TargetInterleukin-1 receptor-associated kinase 4(Homo sapiens (Human))
Bristol-Myers Squibb
US Patent
LigandPNGBDBM187811(US9169252, 354)
Affinity DataIC50:  1.90nMpH: 7.2Assay Description:The assays were performed in U-bottom 384-well plates. The final assay volume was 30 L prepared from 15 L additions of enzyme and substrates (fluores...
In DepthDetails US Patent