BDBM187847 US9169252, 390
SMILES CC(C)(C)NC(=O)c1cnc(cc1Nc1cnn(CC(F)F)c1)-n1ncc2cc(cnc12)C#N
InChI Key InChIKey=FJVZNHUZTQKPIR-UHFFFAOYSA-N
Data  1 IC50
  Tab Delimited (TSV)   2D SDfile   Computed 3D by Vconf -m prep SDfile
Find this compound or compounds like it in BindingDB:
Activity Spreadsheet -- Enzyme Inhibition Constant Data from BindingDB
Found 1 hit for monomerid = 187847
TargetInterleukin-1 receptor-associated kinase 4(Homo sapiens (Human))
Bristol-Myers Squibb
US Patent
LigandPNGBDBM187847(US9169252, 390)
Affinity DataIC50:  17nMpH: 7.2Assay Description:The assays were performed in U-bottom 384-well plates. The final assay volume was 30 L prepared from 15 L additions of enzyme and substrates (fluores...
In DepthDetails US Patent