BDBM188211 US9169259, I-96
SMILES CNC(=O)c1ccc(NC(=O)c2cccc(c2)-c2cc(Nc3ccc(OC)c(OC)n3)c3nccn3n2)cc1
InChI Key InChIKey=NBEDBZLLEGITMM-UHFFFAOYSA-N
Data  1 IC50
  Tab Delimited (TSV)   2D SDfile   Computed 3D by Vconf -m prep SDfile
Find this compound or compounds like it in BindingDB:
Activity Spreadsheet -- Enzyme Inhibition Constant Data from BindingDB
Found 1 hit for monomerid = 188211
TargetTyrosine-protein kinase SYK [360-635](Homo sapiens (Human))
Hoffmann-La Roche
US Patent
LigandPNGBDBM188211(US9169259, I-96)
Affinity DataIC50:  103nM. Assay description: Assay plates: 96-well MultiScreen 0.65 um filter plates (Millipore Cat. No.: MADVNOB10)Streptavidin coated beads: Streptavidin Sepharose, suspension ...
In DepthDetails US Patent