BDBM18828 1-(4-heptylphenyl)-2-methylprop-2-en-1-one::Enone, 4c
SMILES CCCCCCCc1ccc(cc1)C(=O)C(C)=C
InChI Key InChIKey=LFTHMBBMKKTEDY-UHFFFAOYSA-N
Data  2 IC50
  Tab Delimited (TSV)   2D SDfile   Computed 3D by Vconf -m prep SDfile
Find this compound or compounds like it in BindingDB:
Activity Spreadsheet -- Enzyme Inhibition Constant Data from BindingDB
Found 2 hits for monomerid = 18828
TargetThyroid hormone receptor beta [209-461](Homo sapiens (Human))
St. Jude Research Hospital
LigandPNGBDBM18828(1-(4-heptylphenyl)-2-methylprop-2-en-1-one | Enone...)
Affinity DataIC50:  2.32E+4nM. Assay description: IC50 is the concentration of each compound required to inhibit 50% of the binding between the TR LBD and the SRC2-2 peptide using fluorescence polari...
In DepthDetails ArticlePubMed
TargetThyroid hormone receptor alpha [148-410](Homo sapiens (Human))
St. Jude Research Hospital
LigandPNGBDBM18828(1-(4-heptylphenyl)-2-methylprop-2-en-1-one | Enone...)
Affinity DataIC50:  5.29E+4nMpH: 7.2 T: 2°C. Assay description: IC50 is the concentration of each compound required to inhibit 50% of the binding between the TR LBD and the SRC2-2 peptide using fluorescence polari...
In DepthDetails ArticlePubMed