BDBM18888 3-[4-(benzyloxy)-3,5-dibromophenyl]propanoic acid::benzyl derivative, 8
SMILES OC(=O)CCc1cc(Br)c(OCc2ccccc2)c(Br)c1
InChI Key InChIKey=ZCVQDNGOBFARHQ-UHFFFAOYSA-N
Data  2 IC50
  Tab Delimited (TSV)   2D SDfile   Computed 3D by Vconf -m prep SDfile
Find this compound or compounds like it in BindingDB:
Activity Spreadsheet -- Enzyme Inhibition Constant Data from BindingDB
Found 2 hits for monomerid = 18888
TargetThyroid hormone receptor beta(Homo sapiens (Human))
Karo Bio
LigandPNGBDBM18888(3-[4-(benzyloxy)-3,5-dibromophenyl]propanoic acid ...)
Affinity DataIC50:  230nMpH: 7.0 T: 2°C. Assay description: IC50 is the concentration of each compound required to inhibit 50% binding of 125I-T3 to hTRbeta.
In DepthDetails ArticlePubMed
TargetThyroid hormone receptor alpha(Homo sapiens (Human))
Karo Bio
LigandPNGBDBM18888(3-[4-(benzyloxy)-3,5-dibromophenyl]propanoic acid ...)
Affinity DataIC50:  680nMpH: 7.0 T: 2°C. Assay description: IC50 is the concentration of each compound required to inhibit 50% binding of 125I-T3 to hTRalpha.
In DepthDetails ArticlePubMed