BDBM18902 2-[3,5-dibromo-4-(hexyloxy)phenyl]acetic acid::3,5-Dibromo-4-alkoxyphenylalkanoic Acid, 9e
SMILES CCCCCCOc1c(Br)cc(CC(O)=O)cc1Br
InChI Key InChIKey=VJKVJESSSPWLJY-UHFFFAOYSA-N
Data  5 IC50  2 EC50
  Tab Delimited (TSV)   2D SDfile   Computed 3D by Vconf -m prep SDfile
Find this compound or compounds like it in BindingDB:
Activity Spreadsheet -- Enzyme Inhibition Constant Data from BindingDB
Found 5 hits for monomerid = 18902
TargetThyroid hormone receptor alpha(Homo sapiens (Human))
Karo Bio
LigandPNGBDBM18902(2-[3,5-dibromo-4-(hexyloxy)phenyl]acetic acid | 3,...)
Affinity DataIC50:  5.20E+3nM EC50:  0.700nMpH: 7.0 T: 2°C. Assay description: IIC50 is the concentration of each compound required to inhibit 50% binding of 125I-T3 to hTRalpha. EC50 is the concentration of compound required to...
In DepthDetails ArticlePubMed
TargetThyroid hormone receptor beta(Homo sapiens (Human))
Karo Bio
LigandPNGBDBM18902(2-[3,5-dibromo-4-(hexyloxy)phenyl]acetic acid | 3,...)
Affinity DataIC50:  1.50E+3nM EC50:  0.800nMpH: 7.0 T: 2°C. Assay description: IC50 is the concentration of each compound required to inhibit 50% binding of 125I-T3 to hTRbeta. EC50 is the concentration of compound required to i...
In DepthDetails ArticlePubMed
TargetThyroid hormone receptor alpha(Homo sapiens (Human))
Karo Bio
LigandPNGBDBM18902(2-[3,5-dibromo-4-(hexyloxy)phenyl]acetic acid | 3,...)
Affinity DataIC50:  5.25E+3nM. Assay description: Inhibition of thyroid hormone receptor alpha
In DepthDetails ArticlePubMed
TargetThyroid hormone receptor beta(Homo sapiens (Human))
Karo Bio
LigandPNGBDBM18902(2-[3,5-dibromo-4-(hexyloxy)phenyl]acetic acid | 3,...)
Affinity DataIC50:  1.51E+3nM. Assay description: Inhibition of thyroid hormone receptor beta
In DepthDetails ArticlePubMed
TargetThyroid hormone receptor beta(Homo sapiens (Human))
Karo Bio
LigandPNGBDBM18902(2-[3,5-dibromo-4-(hexyloxy)phenyl]acetic acid | 3,...)
Affinity DataIC50:  1.51E+3nM. Assay description: Inhibition of human thyroid hormone receptor beta 1
In DepthDetails ArticlePubMed