BDBM189122 US9169260, 391
SMILES Cc1ccc(cc1)-n1nc(cc1NC(=O)c1cnn2cccnc12)C1CCN(CC1)S(=O)c1ccc(Cl)cc1Cl
InChI Key InChIKey=RLFHDIARVVKOKQ-UHFFFAOYSA-N
Data  1 IC50
  Tab Delimited (TSV)   2D SDfile   Computed 3D by Vconf -m prep SDfile
Find this compound or compounds like it in BindingDB:
Activity Spreadsheet -- Enzyme Inhibition Constant Data from BindingDB
Found 1 hit for monomerid = 189122
TargetInterleukin-1 receptor-associated kinase 4(Homo sapiens (Human))
Merck Sharp & Dohme
US Patent
LigandPNGBDBM189122(US9169260, 391)
Affinity DataIC50: >1.00E+3nMpH: 7.2Assay Description:The kinase activity of IRAK-4 is determined by its ability to catalyze the phosphorylation of a fluorescent polypeptide substrate. The extent of phos...
In DepthDetails US Patent