BDBM189879 US10227346, Example 7::US10426135, Example 7::US9670201, 7 3-cyano-N-(3-(1-isobutyrylpiperidin-4-yl)-1-methyl-4-(trifluoromethyl)-1H-pyrrolo[2,3-b]pyridin-5-yl)-4-methylbenzamide::US9920054, Example 7
SMILES CC(C)C(=O)N1CCC(CC1)c1cn(C)c2ncc(NC(=O)c3ccc(C)c(c3)C#N)c(c12)C(F)(F)F
InChI Key InChIKey=RUJSHKKQJVSRKI-UHFFFAOYSA-N
Data  4 IC50
  Tab Delimited (TSV)   2D SDfile   Computed 3D by Vconf -m prep SDfile
Find this compound or compounds like it in BindingDB:
Activity Spreadsheet -- Enzyme Inhibition Constant Data from BindingDB
Found 4 hits for monomerid = 189879
TargetNuclear receptor ROR-gamma(Homo sapiens (Human))
Pfizer
US Patent
LigandPNGBDBM189879(US10227346, Example 7 | US10426135, Example 7 | US...)
Affinity DataIC50:  4.90nMpH: 7.5 T: 2°C. Assay description: Specifically, in one embodiment the aforementioned assay was performed as outlined below. The assay was carried out in black polystyrene, 384-well pl...
Ligand InfoPC cidPC sid
In DepthDetails US Patent
TargetNuclear receptor ROR-gamma(Homo sapiens (Human))
Pfizer
US Patent
LigandPNGBDBM189879(US10227346, Example 7 | US10426135, Example 7 | US...)
Affinity DataIC50:  4.90nM. Assay description: The activity of compound of the invention can be determined by a co-activator recruitment by TR-FRET (time-resolved fluorescence resonance energy tra...
Ligand InfoPC cidPC sid
In DepthDetails US Patent
TargetNuclear receptor ROR-gamma(Homo sapiens (Human))
Pfizer
US Patent
LigandPNGBDBM189879(US10227346, Example 7 | US10426135, Example 7 | US...)
Affinity DataIC50:  4.90nM
Ligand InfoPC cidPC sid
In DepthDetails US Patent
TargetNuclear receptor ROR-gamma(Homo sapiens (Human))
Pfizer
US Patent
LigandPNGBDBM189879(US10227346, Example 7 | US10426135, Example 7 | US...)
Affinity DataIC50:  4.90nM. Assay description: The activity of compound of the invention can be determined by a co-activator recruitment by TR-FRET (time-resolved fluorescence resonance energy tra...
Ligand InfoPC cidPC sid
In DepthDetails US Patent