BDBM1901 1-[2-(2-methylphenyl)ethyl]-3-1,3-thiazol-2-ylthiourea::N-(2-(2-Methylphenethyl))-N -(2-thiazolyl)thiourea::PETT Analog 8
SMILES Cc1ccccc1CCNC(=S)Nc1nccs1
InChI Key InChIKey=VTSYVNSWDAGAAS-UHFFFAOYSA-N
Data  1 IC50
  Tab Delimited (TSV)   2D SDfile   Computed 3D by Vconf -m prep SDfile
Find this compound or compounds like it in BindingDB:
Activity Spreadsheet -- Enzyme Inhibition Constant Data from BindingDB
Found 1 hit for monomerid = 1901
TargetGag-Pol polyprotein [588-1027]/[588-1147](Human immunodeficiency virus type 1)
Eli Lilly
LigandPNGBDBM1901(1-[2-(2-methylphenyl)ethyl]-3-1,3-thiazol-2-ylthio...)
Affinity DataIC50:  80nM. Assay description: The IC50 of reverse transcriptase is the concentration that inhibits 50% of recombinant HIV-1 RT RNA-directed DNA polymerase activity in vitro.
In DepthDetails ArticlePubMed