BDBM19011 1-(4-methoxyphenyl)-7-oxo-6-{4-[2-(pyrrolidin-1-ylmethyl)phenyl]phenyl}-1H,4H,5H,6H,7H-pyrazolo[3,4-c]pyridine-3-carboxamide::C-3 Carboxamido Pyrazole, 13e
SMILES COc1ccc(cc1)-n1nc(C(N)=O)c2CCN(C(=O)c12)c1ccc(cc1)-c1ccccc1CN1CCCC1
InChI Key InChIKey=AZWOHKZXJMIDFB-UHFFFAOYSA-N
Data  1 KI
  Tab Delimited (TSV)   2D SDfile   Computed 3D by Vconf -m prep SDfile
Find this compound or compounds like it in BindingDB:
Activity Spreadsheet -- Enzyme Inhibition Constant Data from BindingDB
Found 1 hit for monomerid = 19011
TargetCoagulation factor X(Homo sapiens (Human))
Bristol-Myers Squibb
LigandPNGBDBM19011(1-(4-methoxyphenyl)-7-oxo-6-{4-[2-(pyrrolidin-1-yl...)
Affinity DataKi:  0.300nM. Assay description: Ki values were obtained from human purified enzyme. All assays were run in microtiter plates. Plates were read for 30 min at 405 nm. Rates were deter...
In DepthDetails ArticlePubMed