BDBM19016 1-(4-methoxyphenyl)-6-[4-(methylamino)phenyl]-3-(trifluoromethyl)-1H,4H,5H,6H,7H-pyrazolo[3,4-c]pyridin-7-one::trifluoromethylpyrazole analogue, 36c
SMILES CNc1ccc(cc1)N1CCc2c(nn(c2C1=O)-c1ccc(OC)cc1)C(F)(F)F
InChI Key InChIKey=LRJGICFBUGSISP-UHFFFAOYSA-N
Data  2 KI
  Tab Delimited (TSV)   2D SDfile   Computed 3D by Vconf -m prep SDfile
Find this compound or compounds like it in BindingDB:
Activity Spreadsheet -- Enzyme Inhibition Constant Data from BindingDB
Found 2 hits for monomerid = 19016
TargetCoagulation factor X(Homo sapiens (Human))
Bristol-Myers Squibb
LigandPNGBDBM19016(1-(4-methoxyphenyl)-6-[4-(methylamino)phenyl]-3-(t...)
Affinity DataKi:  610nM. Assay description: Ki values were obtained from human purified enzyme. All assays were run in microtiter plates. Plates were read for 30 min at 405 nm. Rates were deter...
In DepthDetails ArticlePubMed
TargetProthrombin(Homo sapiens (Human))
Bristol-Myers Squibb
LigandPNGBDBM19016(1-(4-methoxyphenyl)-6-[4-(methylamino)phenyl]-3-(t...)
Affinity DataKi: >6.30E+3nM. Assay description: Ki values were obtained from human purified enzyme. All assays were run in microtiter plates. Plates were read for 30 min at 405 nm. Rates were deter...
In DepthDetails ArticlePubMed