BDBM190292 US9180116, 38C
SMILES C[C@@H](CCCCc1ccccc1)[C@H](O)\C=C\[C@H]1CC(F)(F)C(=O)N1CCCc1ccc(s1)C(O)=O
InChI Key InChIKey=WQNDXGHRPMQDFT-LKLUEYJESA-N
Data  2 EC50
  Tab Delimited (TSV)   2D SDfile   Computed 3D by Vconf -m prep SDfile
Find this compound or compounds like it in BindingDB:
Activity Spreadsheet -- Enzyme Inhibition Constant Data from BindingDB
Found 2 hits for monomerid = 190292
TargetProstaglandin E2 receptor EP2 subtype(Homo sapiens (Human))
Cayman Chemical
US Patent
LigandPNGBDBM190292(US9180116, 38C)
Affinity DataEC50:  157nMT: 2°C. Assay description: 1. Seed cells on an EP2 or EP4 STEP plate at a density of 40,000-80,000 cells/well in 200 ul of reduced serum medium containing 0.5% FBS. Place the p...
In DepthDetails US Patent
TargetProstaglandin E2 receptor EP4 subtype(Homo sapiens (Human))
Cayman Chemical
US Patent
LigandPNGBDBM190292(US9180116, 38C)
Affinity DataEC50:  1.40E-7nMT: 2°C. Assay description: 1. Seed cells on an EP2 or EP4 STEP plate at a density of 40,000-80,000 cells/well in 200 uL of reduced serum medium containing 0.5% FBS. Place the p...
In DepthDetails US Patent