BDBM190438 US9180192, 33
SMILES O=C(Nc1cnn(c1)S(=O)(=O)c1ccsc1)c1ccccn1
InChI Key InChIKey=FOSFPMDXYCJXNT-UHFFFAOYSA-N
Data  1 EC50
  Tab Delimited (TSV)   2D SDfile   Computed 3D by Vconf -m prep SDfile
Find this compound or compounds like it in BindingDB:
Activity Spreadsheet -- Enzyme Inhibition Constant Data from BindingDB
Found 1 hit for monomerid = 190438
TargetMetabotropic glutamate receptor 4(Homo sapiens (Human))
Vanderbilt University
US Patent
LigandPNGBDBM190438(US9180192, 33)
Affinity DataEC50:  1.06E+3nM. Assay description: The disclosed compounds and compositions can be evaluated for their ability to act as a potentiator of metabotropic glutamate receptor activity, in p...
Ligand InfoPC cidPC sid
In DepthDetails US Patent