BDBM190457 US9181181, 5
SMILES CS(=O)(=O)Oc1ccc(CC(=O)OCCc2ccc(CC(SCCc3ccc(F)cc3)C(O)=O)cc2)cc1
InChI Key InChIKey=MWXQXPSHHMUYAE-UHFFFAOYSA-N
Data  2 EC50
  Tab Delimited (TSV)   2D SDfile   Computed 3D by Vconf -m prep SDfile
Find this compound or compounds like it in BindingDB:
Activity Spreadsheet -- Enzyme Inhibition Constant Data from BindingDB
Found 2 hits for monomerid = 190457
TargetPeroxisome proliferator-activated receptor gamma [205-505](Homo sapiens (Human))
Albireo
US Patent
LigandPNGBDBM190457(US9181181, 5)
Affinity DataEC50:  6.00E+3nM. Assay description: Transactivation Assay Expression vectors were prepared by inserting the ligand binding domain cDNA (complementary DNA) of human PPARalpha (amino acid...
In DepthDetails US Patent
TargetPeroxisome proliferator-activated receptor alpha [169-468](Homo sapiens (Human))
Albireo
US Patent
LigandPNGBDBM190457(US9181181, 5)
Affinity DataEC50:  200nM. Assay description: Transactivation Assay Expression vectors were prepared by inserting the ligand binding domain cDNA (complementary DNA) of human PPARalpha (amino acid...
In DepthDetails US Patent