BDBM190486 US9181181, 34
SMILES OC(=O)c1ccccc1CSc1ccc(CC(=O)OC(CC=C)c2ccccc2)cc1
InChI Key InChIKey=JVENQZZNMYOHID-UHFFFAOYSA-N
Data  2 EC50
  Tab Delimited (TSV)   2D SDfile   Computed 3D by Vconf -m prep SDfile
Find this compound or compounds like it in BindingDB:
Activity Spreadsheet -- Enzyme Inhibition Constant Data from BindingDB
Found 2 hits for monomerid = 190486
TargetPeroxisome proliferator-activated receptor gamma [205-505](Homo sapiens (Human))
Albireo
US Patent
LigandPNGBDBM190486(US9181181, 34)
Affinity DataEC50:  1.50E+4nM. Assay description: Transactivation Assay Expression vectors were prepared by inserting the ligand binding domain cDNA (complementary DNA) of human PPARalpha (amino acid...
Ligand InfoPC cidPC sid
In DepthDetails US Patent
TargetPeroxisome proliferator-activated receptor alpha [169-468](Homo sapiens (Human))
Albireo
US Patent
LigandPNGBDBM190486(US9181181, 34)
Affinity DataEC50:  1.80E+4nM. Assay description: Transactivation Assay Expression vectors were prepared by inserting the ligand binding domain cDNA (complementary DNA) of human PPARalpha (amino acid...
Ligand InfoPC cidPC sid
In DepthDetails US Patent