BDBM190487 US9181181, 35
SMILES COC(=O)C(Cc1ccccc1)OC(=O)Cc1cccc(SCc2ccccc2C(O)=O)c1
InChI Key InChIKey=TUUFTMIGNYKJRE-UHFFFAOYSA-N
Data  2 EC50
  Tab Delimited (TSV)   2D SDfile   Computed 3D by Vconf -m prep SDfile
Find this compound or compounds like it in BindingDB:
Activity Spreadsheet -- Enzyme Inhibition Constant Data from BindingDB
Found 2 hits for monomerid = 190487
TargetPeroxisome proliferator-activated receptor gamma [205-505](Homo sapiens (Human))
Albireo
US Patent
LigandPNGBDBM190487(US9181181, 35)
Affinity DataEC50:  6.00E+3nM. Assay description: Transactivation Assay Expression vectors were prepared by inserting the ligand binding domain cDNA (complementary DNA) of human PPARalpha (amino acid...
In DepthDetails US Patent
TargetPeroxisome proliferator-activated receptor alpha [169-468](Homo sapiens (Human))
Albireo
US Patent
LigandPNGBDBM190487(US9181181, 35)
Affinity DataEC50:  2.20E+4nM. Assay description: Transactivation Assay Expression vectors were prepared by inserting the ligand binding domain cDNA (complementary DNA) of human PPARalpha (amino acid...
In DepthDetails US Patent