BDBM190491 US9181181, 39
SMILES COC(=O)C(c1ncco1)(c1ccccc1)c1ccc(SCc2ccccc2C(O)=O)cc1
InChI Key InChIKey=MRHVWDNZDAVGRG-UHFFFAOYSA-N
Data  2 EC50
  Tab Delimited (TSV)   2D SDfile   Computed 3D by Vconf -m prep SDfile
Find this compound or compounds like it in BindingDB:
Activity Spreadsheet -- Enzyme Inhibition Constant Data from BindingDB
Found 2 hits for monomerid = 190491
TargetPeroxisome proliferator-activated receptor gamma [205-505](Homo sapiens (Human))
Albireo
US Patent
LigandPNGBDBM190491(US9181181, 39)
Affinity DataEC50:  1.80E+4nM. Assay description: Transactivation Assay Expression vectors were prepared by inserting the ligand binding domain cDNA (complementary DNA) of human PPARalpha (amino acid...
Ligand InfoPC cidPC sid
In DepthDetails US Patent
TargetPeroxisome proliferator-activated receptor alpha [169-468](Homo sapiens (Human))
Albireo
US Patent
LigandPNGBDBM190491(US9181181, 39)
Affinity DataEC50:  1.30E+4nM. Assay description: Transactivation Assay Expression vectors were prepared by inserting the ligand binding domain cDNA (complementary DNA) of human PPARalpha (amino acid...
Ligand InfoPC cidPC sid
In DepthDetails US Patent