BDBM19068 (2S)-3-[(benzylcarbamoyl)amino]-2-{[(2S)-1-(naphthalene-2-sulfonyl)pyrrolidin-2-yl]formamido}propanoic acid::prolyl-2,3-diaminopropionic acid (DAP) scaffold, 24
SMILES OC(=O)[C@H](CNC(=O)NCc1ccccc1)NC(=O)[C@@H]1CCCN1S(=O)(=O)c1ccc2ccccc2c1
InChI Key InChIKey=WQVOUYNTLLCWOA-GOTSBHOMSA-N
Data  4 IC50
  Tab Delimited (TSV)   2D SDfile   Computed 3D by Vconf -m prep SDfile
Find this compound or compounds like it in BindingDB:
Activity Spreadsheet -- Enzyme Inhibition Constant Data from BindingDB
Found 5 hits for monomerid = 19068
TargetIntegrin alpha-2/beta-1 [T112H](Homo sapiens (Human))
University Of Pennsylvania
LigandPNGBDBM19068((2S)-3-[(benzylcarbamoyl)amino]-2-{[(2S)-1-(naphth...)
Affinity DataIC50:  50nMpH: 7.4 T: 2°C. Assay description: Flat bottom microtiter plates (96-well) were coated with soluble type I collagen. Unoccupied protein binding sites on the wells were blocked with bov...
In DepthDetails ArticlePubMed
TargetIntegrin alpha-1/beta-1 [T112H](Homo sapiens (Human))
University Of Pennsylvania
LigandPNGBDBM19068((2S)-3-[(benzylcarbamoyl)amino]-2-{[(2S)-1-(naphth...)
Affinity Data. Assay description: The ligand was immobilized on 96-well flat microtiter in PBS buffer solution overnight, and the wells were blocked with 1% BSA in HBSS buffer solutio...
In DepthDetails ArticlePubMed
TargetIntegrin alpha-5/beta-1 [T112H](Homo sapiens (Human))
University Of Pennsylvania
LigandPNGBDBM19068((2S)-3-[(benzylcarbamoyl)amino]-2-{[(2S)-1-(naphth...)
Affinity DataIC50: >1.00E+4nM. Assay description: The ligand was immobilized on 96-well flat microtiter in acetic acid solution overnight, and the wells were blocked with 1% BSA in HyQ HBSS buffer co...
In DepthDetails ArticlePubMed
TargetIntegrin alpha-4/beta-1 [T112H](Homo sapiens (Human))
University Of Pennsylvania
LigandPNGBDBM19068((2S)-3-[(benzylcarbamoyl)amino]-2-{[(2S)-1-(naphth...)
Affinity DataIC50:  4.33E+3nM. Assay description: The ligand was immobilized on 96-well flat microtiter in acetic acid solution overnight, and the wells were blocked with 1% BSA in HyQ HBSS buffer co...
In DepthDetails ArticlePubMed
TargetIntegrin alpha-2/beta-1 [T112H](Homo sapiens (Human))
University Of Pennsylvania
LigandPNGBDBM19068((2S)-3-[(benzylcarbamoyl)amino]-2-{[(2S)-1-(naphth...)
Affinity DataIC50:  177nM. Assay description: The ligand was immobilized on 96-well flat microtiter in PBS buffer solution overnight, and the wells were blocked with 1% BSA in HBSS buffer solutio...
In DepthDetails ArticlePubMed