BDBM191272 US9181272, 42
SMILES NC(=O)N1CCCc2cc(cnc12)-c1cncc(CO)c1
InChI Key InChIKey=KZNDBPRPKAMVJP-UHFFFAOYSA-N
Data  1 IC50
  Tab Delimited (TSV)   2D SDfile   Computed 3D by Vconf -m prep SDfile
Find this compound or compounds like it in BindingDB:
Activity Spreadsheet -- Enzyme Inhibition Constant Data from BindingDB
Found 1 hit for monomerid = 191272
TargetCytochrome P450 family 11 subfamily B member 2(Cercopithecus sabaeus)
Boehringer Ingelheim International
US Patent
LigandPNGBDBM191272(US9181272, 42)
Affinity DataIC50:  9.20nMpH: 7.4Assay Description:The aldosterone synthase inhibition assay employs cynomolgus adrenal gland mitochondria as the source of aldosterone synthase (CYP11B2). Mitochondr...
In DepthDetails US Patent