BDBM191309 US9181272, 79
SMILES CC(=O)N1CCC(CC1)c1cncc(c1)-c1cnc2N(CCCc2c1)C(N)=O
InChI Key InChIKey=VYLIGZQEFJXVFP-UHFFFAOYSA-N
Data  1 IC50
  Tab Delimited (TSV)   2D SDfile   Computed 3D by Vconf -m prep SDfile
Find this compound or compounds like it in BindingDB:
Activity Spreadsheet -- Enzyme Inhibition Constant Data from BindingDB
Found 1 hit for monomerid = 191309
TargetCytochrome P450 family 11 subfamily B member 2(Cercopithecus sabaeus)
Boehringer Ingelheim International
US Patent
LigandPNGBDBM191309(US9181272, 79)
Affinity DataIC50:  83.2nMpH: 7.4Assay Description:The aldosterone synthase inhibition assay employs cynomolgus adrenal gland mitochondria as the source of aldosterone synthase (CYP11B2). Mitochondr...
In DepthDetails US Patent