BDBM191803 US9187428, 31
SMILES CNC(=O)c1cc(CSc2ncc(C#N)c(-c3ccc(OC)cc3)c2C#N)ccn1
InChI Key InChIKey=LYEJXPMWXNERKG-UHFFFAOYSA-N
Data  3 EC50
  Tab Delimited (TSV)   2D SDfile   Computed 3D by Vconf -m prep SDfile
Find this compound or compounds like it in BindingDB:
Activity Spreadsheet -- Enzyme Inhibition Constant Data from BindingDB
Found 3 hits for monomerid = 191803
TargetAdenosine receptor A1(Homo sapiens (Human))
Bayer Intellectual Property
US Patent
LigandPNGBDBM191803(US9187428, 31)
Affinity DataEC50:  1.60nMpH: 7.4 T: 2°C. Assay description: The following test protocol is used for pharmacologically characterizing cells and for the robot-assisted substance screening:The stock cultures ar...
In DepthDetails US Patent
TargetAdenosine receptor A2b(Homo sapiens (Human))
Bayer Intellectual Property
US Patent
LigandPNGBDBM191803(US9187428, 31)
Affinity DataEC50:  708nMpH: 7.4 T: 2°C. Assay description: The following test protocol is used for pharmacologically characterizing cells and for the robot-assisted substance screening:The stock cultures ar...
In DepthDetails US Patent
TargetAdenosine receptor A2a(Homo sapiens (Human))
Bayer Intellectual Property
US Patent
LigandPNGBDBM191803(US9187428, 31)
Affinity DataEC50:  707nMpH: 7.4 T: 2°C. Assay description: The following test protocol is used for pharmacologically characterizing cells and for the robot-assisted substance screening:The stock cultures ar...
In DepthDetails US Patent