BDBM192336 US9670204, 107 (2-(2-((2-ethyl-6-(1-(methylsulfonyl)piperidin-4-yl)imidazo[1,2-a]pyridin-3-yl)(methyl)amino)thiazol-4-yl)-5-fluorophenyl)methanol
SMILES CCc1nc2ccc(cn2c1N(C)c1nc(cs1)-c1ccc(F)cc1CO)C1CCN(CC1)S(C)(=O)=O
InChI Key InChIKey=KLESIVUURRNEOC-UHFFFAOYSA-N
Data  1 IC50
  Tab Delimited (TSV)   2D SDfile   Computed 3D by Vconf -m prep SDfile
Find this compound or compounds like it in BindingDB:
Activity Spreadsheet -- Enzyme Inhibition Constant Data from BindingDB
Found 1 hit for monomerid = 192336
TargetEctonucleotide pyrophosphatase/phosphodiesterase family member 2(Homo sapiens (Human))
Galapagos
US Patent
LigandPNGBDBM192336(US9670204, 107 (2-(2-((2-ethyl-6-(1-(methylsulfony...)
Affinity DataIC50:  750nMpH: 8.5 T: 2°C. Assay description: Compound IC50 values are determined in a hENPP2 (UniProtKB/SwissProt Sequence ref Q13822) biochemical assay using LPC as substrate. 5 μL of a di...
Ligand InfoPC cidPC sid
In DepthDetails US Patent