BDBM192522 US9187480, N-{[4-({[8-(2-chlorophenyl)-9-(4-chlorophenyl)-9H-purin-6-yl]amino}methyl)cyclohexyl]methyl}methanesulfonamide
SMILES CS(=O)(=O)NCC1CCC(CNc2ncnc3n(c(nc23)-c2ccccc2Cl)-c2ccc(Cl)cc2)CC1
InChI Key InChIKey=YBDBPVNGDPRTNK-UHFFFAOYSA-N
Data  3 KI
  Tab Delimited (TSV)   2D SDfile   Computed 3D by Vconf -m prep SDfile
Find this compound or compounds like it in BindingDB:
Activity Spreadsheet -- Enzyme Inhibition Constant Data from BindingDB
Found 3 hits for monomerid = 192522
TargetCannabinoid receptor 1(Homo sapiens (Human))
Research Triangle Institute
US Patent
LigandPNGBDBM192522(US9187480, N-{[4-({[8-(2-chlorophenyl)-9-(4-chloro...)
Affinity DataKi:  44.5nM. Assay description: Further characterization of select compounds was performed using radioligand displacement of [3H]1 and equilibrium dissociation constant (Ki) values ...
In DepthDetails US Patent
TargetCannabinoid receptor 1(Homo sapiens (Human))
Research Triangle Institute
US Patent
LigandPNGBDBM192522(US9187480, N-{[4-({[8-(2-chlorophenyl)-9-(4-chloro...)
Affinity DataKi:  258nM. Assay description: Further characterization of select compounds was performed using radioligand displacement of [3H]1 and equilibrium dissociation constant (Ki) values ...
In DepthDetails US Patent
TargetCannabinoid receptor 2(Homo sapiens (Human))
Research Triangle Institute
US Patent
LigandPNGBDBM192522(US9187480, N-{[4-({[8-(2-chlorophenyl)-9-(4-chloro...)
Affinity DataKi:  2.23E+3nM. Assay description: Further characterization of select compounds was performed using radioligand displacement of [3H]1 and equilibrium dissociation constant (Ki) values ...
In DepthDetails US Patent