BDBM192830 US9192603, 3
SMILES Clc1ccccc1CS(=O)(=O)c1sc(NC(=O)c2ccccn2)nc1C1CC1
InChI Key InChIKey=VDLZIICIZAEICO-UHFFFAOYSA-N
Data  1 EC50
  Tab Delimited (TSV)   2D SDfile   Computed 3D by Vconf -m prep SDfile
Find this compound or compounds like it in BindingDB:
Activity Spreadsheet -- Enzyme Inhibition Constant Data from BindingDB
Found 1 hit for monomerid = 192830
TargetMetabotropic glutamate receptor 4(Homo sapiens (Human))
Vanderbilt University
US Patent
LigandPNGBDBM192830(US9192603, 3)
Affinity DataEC50:  2.98E+3nM. Assay description: The disclosed compounds and compositions can be evaluated for their ability to act as a potentiator of metabotropic glutamate receptor activity, in p...
In DepthDetails US Patent