BDBM192952 US10526329, Compound 147::US11072611, Compound 147::US9670204, 147 (2-((2-ethyl-6-(1-(methylsulfonyl)piperidin-4-yl)imidazo[1,2-a]pyridin-3-yl)(methyl)amino)-4-(4-fluorophenyl)thiazol-5-yl)methanol
SMILES CCc1nc2ccc(cn2c1N(C)c1nc(c(CO)s1)-c1ccc(F)cc1)C1CCN(CC1)S(C)(=O)=O
InChI Key InChIKey=ITYXIKDVYHQOHD-UHFFFAOYSA-N
Data  5 IC50
  Tab Delimited (TSV)   2D SDfile   Computed 3D by Vconf -m prep SDfile
Find this compound or compounds like it in BindingDB:
Activity Spreadsheet -- Enzyme Inhibition Constant Data from BindingDB
Found 5 hits for monomerid = 192952
TargetEctonucleotide pyrophosphatase/phosphodiesterase family member 2(Homo sapiens (Human))
Galapagos
US Patent
LigandPNGBDBM192952(US10526329, Compound 147 | US11072611, Compound 14...)
Affinity DataIC50:  300nMpH: 8.5 T: 2°C. Assay description: Compound IC50 values are determined in a hENPP2 (UniProtKB/SwissProt Sequence ref Q13822) biochemical assay using LPC as substrate. 5 μL of a di...
Ligand InfoPC cidPC sid
In DepthDetails US Patent
TargetEctonucleotide pyrophosphatase/phosphodiesterase family member 2(Homo sapiens (Human))
Galapagos
US Patent
LigandPNGBDBM192952(US10526329, Compound 147 | US11072611, Compound 14...)
Affinity DataIC50:  300nM. Assay description: Compound IC50 values are determined in a hENPP2 (UniProtKB/SwissProt Sequence ref Q13822) biochemical assay using LPC as substrate.5 μL of a dil...
Ligand InfoPC cidPC sid
In DepthDetails US Patent
TargetEctonucleotide pyrophosphatase/phosphodiesterase family member 2(Homo sapiens (Human))
Galapagos
US Patent
LigandPNGBDBM192952(US10526329, Compound 147 | US11072611, Compound 14...)
Affinity DataIC50:  50nM. Assay description: TABLE VI: (UniProtKB/SwissProt Sequence ref Q13822) biochemical assay using the fluorogenic autotaxin substrate FS-3 as substrate. FS-3 is a doubly l...
Ligand InfoPC cidPC sid
In DepthDetails US Patent
TargetEctonucleotide pyrophosphatase/phosphodiesterase family member 2(Homo sapiens (Human))
Galapagos
US Patent
LigandPNGBDBM192952(US10526329, Compound 147 | US11072611, Compound 14...)
Affinity DataIC50:  300nM. Assay description: TABLE V: 5 μL of a dilution series of compound, starting from 20 μM highest concentration, 1/5 dilution, is added to the wells. hENPP2 is u...
Ligand InfoPC cidPC sid
In DepthDetails US Patent
TargetEctonucleotide pyrophosphatase/phosphodiesterase family member 2(Homo sapiens (Human))
Galapagos
US Patent
LigandPNGBDBM192952(US10526329, Compound 147 | US11072611, Compound 14...)
Affinity DataIC50:  50nM
Ligand InfoPC cidPC sid
In DepthDetails US Patent