BDBM192989 US10526329, Compound 169::US11072611, Compound 169::US9670204, 169 2-(4-(3-((4-(2-cyano-4-fluorophenyl)thiazol-2-yl)(methyl)amino)-2-ethylimidazo[1,2-a]pyridin-6-yl)piperazin-1-yl)-N-methylacetamide
SMILES CCc1nc2ccc(cn2c1N(C)c1nc(cs1)-c1ccc(F)cc1C#N)N1CCN(CC(=O)NC)CC1
InChI Key InChIKey=ZBWCCKDEPNMVJU-UHFFFAOYSA-N
Data  3 IC50
  Tab Delimited (TSV)   2D SDfile   Computed 3D by Vconf -m prep SDfile
Find this compound or compounds like it in BindingDB:
Activity Spreadsheet -- Enzyme Inhibition Constant Data from BindingDB
Found 3 hits for monomerid = 192989
TargetEctonucleotide pyrophosphatase/phosphodiesterase family member 2(Homo sapiens (Human))
Galapagos
US Patent
LigandPNGBDBM192989(US10526329, Compound 169 | US11072611, Compound 16...)
Affinity DataIC50:  50nMpH: 8.5 T: 2°C. Assay description: Compound IC50 values are determined in a hENPP2 (UniProtKB/SwissProt Sequence ref Q13822) biochemical assay using LPC as substrate. 5 μL of a di...
Ligand InfoPC cidPC sid
In DepthDetails US Patent
TargetEctonucleotide pyrophosphatase/phosphodiesterase family member 2(Homo sapiens (Human))
Galapagos
US Patent
LigandPNGBDBM192989(US10526329, Compound 169 | US11072611, Compound 16...)
Affinity DataIC50:  50nM. Assay description: TABLE V: 5 μL of a dilution series of compound, starting from 20 μM highest concentration, 1/5 dilution, is added to the wells. hENPP2 is u...
Ligand InfoPC cidPC sid
In DepthDetails US Patent
TargetEctonucleotide pyrophosphatase/phosphodiesterase family member 2(Homo sapiens (Human))
Galapagos
US Patent
LigandPNGBDBM192989(US10526329, Compound 169 | US11072611, Compound 16...)
Affinity DataIC50:  50nM. Assay description: Compound IC50 values are determined in a hENPP2 (UniProtKB/SwissProt Sequence ref Q13822) biochemical assay using LPC as substrate.5 μL of a dil...
Ligand InfoPC cidPC sid
In DepthDetails US Patent