BDBM1930 4-hydroxy-7-methoxy-3-(1-phenylpropyl)-2H-chromen-2-one::Carboxamide-Containing 4-Hydroxycoumarin analogue XI
SMILES CCC(c1ccccc1)c1c(O)c2ccc(OC)cc2oc1=O
InChI Key InChIKey=CCPGCKQLIHGSCJ-UHFFFAOYSA-N
Data  1 KI
PDB links: 1 PDB ID matches this monomer.
  Tab Delimited (TSV)   2D SDfile   Computed 3D by Vconf -m prep SDfile
Find this compound or compounds like it in BindingDB:
Activity Spreadsheet -- Enzyme Inhibition Constant Data from BindingDB
Found 1 hit for monomerid = 1930
TargetDimer of Gag-Pol polyprotein [489-587](Human immunodeficiency virus type 1)
Upjohn
LigandPNGBDBM1930(4-hydroxy-7-methoxy-3-(1-phenylpropyl)-2H-chromen-...)
Affinity DataKi:  560nM ΔG°:  -8.44kcal/molepH: 5.0 T: 2°C. Assay description: HIV-1 protease was purified and refolded from E. coli inclusion bodies. The substrate used spans the p17-p24 processing site (R-V-S-Q-N-Y-P-I-V-Q-N-K...
In DepthDetails ArticlePubMed