BDBM193132 US9193736, 48
SMILES OC(=O)CCC(=O)Nc1ccc(cc1)-c1c(\C=C\c2ccc3ccccc3n2)nc2c(ccnn12)N1CCOCC1
InChI Key InChIKey=MNVPOEXLKGFNBZ-VAWYXSNFSA-N
Data  2 IC50
  Tab Delimited (TSV)   2D SDfile   Computed 3D by Vconf -m prep SDfile
Find this compound or compounds like it in BindingDB:
Activity Spreadsheet -- Enzyme Inhibition Constant Data from BindingDB
Found 2 hits for monomerid = 193132
LigandPNGBDBM193132(US9193736, 48)
Affinity DataIC50:  9nM. Assay description: Human recombinant PDE10A2 was expressed in Sf9 cells, using a recombinant baculovirus construct containing the full length sequence containing a 6ÿH...
In DepthDetails US Patent
TargetcAMP and cAMP-inhibited cGMP 3',5'-cyclic phosphodiesterase 10A(Rattus norvegicus (rat))
Janssen Pharmaceutica
US Patent
LigandPNGBDBM193132(US9193736, 48)
Affinity DataIC50:  6nMpH: 7.8Assay Description:Rat recombinant PDE10a (rPDE10a) was expressed in Sf9 cells using a recombinant rPDE10a baculovirus construct. Cells were harvested after 48 h of inf...
In DepthDetails US Patent