BDBM193310 US9199927, 21
SMILES NC(=N)Nc1ccc(cc1)C(=O)Oc1ccc2nc(ccc2c1)C(=O)NC(C(O)=O)c1ccccc1
InChI Key InChIKey=URBHOBROHUTPDR-UHFFFAOYSA-N
Data  2 IC50
  Tab Delimited (TSV)   2D SDfile   Computed 3D by Vconf -m prep SDfile
Find this compound or compounds like it in BindingDB:
Activity Spreadsheet -- Enzyme Inhibition Constant Data from BindingDB
Found 2 hits for monomerid = 193310
TargetTrypsinogen 16(Mus musculus (Mouse))
Astellas Pharma
US Patent
LigandPNGBDBM193310(US9199927, 21)
Affinity DataIC50:  0.170nMpH: 8.0 T: 2°C. Assay description: The compound was dissolved in dimethyl sulfoxide (DMSO), and diluted to an arbitrary concentration (A). A was 100-fold diluted with a buffer (0.1 M T...
In DepthDetails US Patent
TargetSerine protease 1(Homo sapiens (Human))
Astellas Pharma
US Patent
LigandPNGBDBM193310(US9199927, 21)
Affinity DataIC50:  0.260nMpH: 8.0 T: 2°C. Assay description: The compound was dissolved in dimethyl sulfoxide (DMSO), and diluted to an arbitrary concentration (A). A was 100-fold diluted with a buffer (0.1 M T...
In DepthDetails US Patent