BDBM193339 US10526329, Compound 217::US11072611, Compound 217::US9670204, 217 N-(6-(1-benzylpiperidin-4-yl)-2-ethylimidazo[1,2-a]pyridin-3-yl)-4-(4-fluorophenyl)-N-methylthiazol-2-amine
SMILES CCc1nc2ccc(cn2c1N(C)c1nc(cs1)-c1ccc(F)cc1)C1CCN(Cc2ccccc2)CC1
InChI Key InChIKey=PHTGKJFKPGDKPD-UHFFFAOYSA-N
Data  5 IC50
  Tab Delimited (TSV)   2D SDfile   Computed 3D by Vconf -m prep SDfile
Find this compound or compounds like it in BindingDB:
Activity Spreadsheet -- Enzyme Inhibition Constant Data from BindingDB
Found 5 hits for monomerid = 193339
TargetEctonucleotide pyrophosphatase/phosphodiesterase family member 2(Homo sapiens (Human))
Galapagos
US Patent
LigandPNGBDBM193339(US10526329, Compound 217 | US11072611, Compound 21...)
Affinity DataIC50: >1.00E+3nMpH: 8.5 T: 2°C. Assay description: Compound IC50 values are determined in a hENPP2 (UniProtKB/SwissProt Sequence ref Q13822) biochemical assay using LPC as substrate. 5 μL of a di...
Ligand InfoPC cidPC sid
In DepthDetails US Patent
TargetEctonucleotide pyrophosphatase/phosphodiesterase family member 2(Homo sapiens (Human))
Galapagos
US Patent
LigandPNGBDBM193339(US10526329, Compound 217 | US11072611, Compound 21...)
Affinity DataIC50:  50nM
Ligand InfoPC cidPC sid
In DepthDetails US Patent
TargetEctonucleotide pyrophosphatase/phosphodiesterase family member 2(Homo sapiens (Human))
Galapagos
US Patent
LigandPNGBDBM193339(US10526329, Compound 217 | US11072611, Compound 21...)
Affinity DataIC50:  50nM. Assay description: TABLE VI: (UniProtKB/SwissProt Sequence ref Q13822) biochemical assay using the fluorogenic autotaxin substrate FS-3 as substrate. FS-3 is a doubly l...
Ligand InfoPC cidPC sid
In DepthDetails US Patent
TargetEctonucleotide pyrophosphatase/phosphodiesterase family member 2(Homo sapiens (Human))
Galapagos
US Patent
LigandPNGBDBM193339(US10526329, Compound 217 | US11072611, Compound 21...)
Affinity DataIC50: >1.00E+3nM. Assay description: TABLE V: 5 μL of a dilution series of compound, starting from 20 μM highest concentration, 1/5 dilution, is added to the wells. hENPP2 is u...
Ligand InfoPC cidPC sid
In DepthDetails US Patent
TargetEctonucleotide pyrophosphatase/phosphodiesterase family member 2(Homo sapiens (Human))
Galapagos
US Patent
LigandPNGBDBM193339(US10526329, Compound 217 | US11072611, Compound 21...)
Affinity DataIC50: >1.00E+3nM. Assay description: Compound IC50 values are determined in a hENPP2 (UniProtKB/SwissProt Sequence ref Q13822) biochemical assay using LPC as substrate.5 μL of a dil...
Ligand InfoPC cidPC sid
In DepthDetails US Patent